Ticket #68663: main.log

File main.log, 24.8 KB (added by RobK88, 11 months ago)
Line 
1version:1
2:debug:main Starting logging for faad2 @2.11.0_0+universal
3:debug:sysinfo macOS 10.13.6 (darwin/17.7.0) arch i386
4:debug:sysinfo MacPorts 2.8.1
5:debug:sysinfo Xcode 10.1, CLT 10.1.0.0.1.1539992718
6:debug:sysinfo SDK 10.13
7:debug:sysinfo MACOSX_DEPLOYMENT_TARGET: 10.13
8:msg:main --->  Computing dependencies for faad2:info:main .:debug:main faad2 has no conflicts
9:debug:main Searching for dependency: cmake
10:debug:main Found Dependency: receipt exists for cmake
11:debug:main Executing org.macports.main (faad2)
12:debug:main dropping privileges: euid changed to 504, egid changed to 501.
13:debug:archivefetch archivefetch phase started at Wed Nov  8 18:44:03 EST 2023
14:msg:archivefetch --->  Fetching archive for faad2
15:debug:archivefetch Executing org.macports.archivefetch (faad2)
16:debug:archivefetch euid/egid changed to: 0/0
17:debug:archivefetch chowned /opt/local/var/macports/incoming to macports
18:debug:archivefetch euid/egid changed to: 504/501
19:info:archivefetch --->  faad2-2.11.0_0+universal.darwin_17.i386-x86_64.tbz2 doesn't seem to exist in /opt/local/var/macports/incoming/verified
20:msg:archivefetch --->  Attempting to fetch faad2-2.11.0_0+universal.darwin_17.i386-x86_64.tbz2 from http://packages.macports.org/faad2
21:debug:archivefetch Fetching archive failed: The requested URL returned error: 404 Not Found
22:msg:archivefetch --->  Attempting to fetch faad2-2.11.0_0+universal.darwin_17.i386-x86_64.tbz2 from http://ywg.ca.packages.macports.org/mirror/macports/packages/faad2
23:debug:archivefetch Fetching archive failed: The requested URL returned error: 404 Not Found
24:msg:archivefetch --->  Attempting to fetch faad2-2.11.0_0+universal.darwin_17.i386-x86_64.tbz2 from http://mirror.fcix.net/macports/packages/faad2
25:debug:archivefetch Fetching archive failed: The requested URL returned error: 404 Not Found
26:debug:archivefetch Privilege de-escalation not attempted as not running as root.
27:debug:fetch fetch phase started at Wed Nov  8 18:44:03 EST 2023
28:notice:fetch --->  Fetching distfiles for faad2
29:debug:fetch Executing org.macports.fetch (faad2)
30:debug:fetch Privilege de-escalation not attempted as not running as root.
31:debug:checksum checksum phase started at Wed Nov  8 18:44:03 EST 2023
32:notice:checksum --->  Verifying checksums for faad2
33:debug:checksum Executing org.macports.checksum (faad2)
34:info:checksum --->  Checksumming faad2-2.11.0.tar.gz
35:debug:checksum Calculated (rmd160) is 1a7b27c0e152cc6c7d1cde184744338ae4d4e19d
36:debug:checksum Correct (rmd160) checksum for faad2-2.11.0.tar.gz
37:debug:checksum Calculated (sha256) is 720c1dc404439e0a9117aa144dc7ead56f1658adf4badbb39f959d6ad8eed489
38:debug:checksum Correct (sha256) checksum for faad2-2.11.0.tar.gz
39:debug:checksum Calculated (size) is 656610
40:debug:checksum Correct (size) checksum for faad2-2.11.0.tar.gz
41:debug:checksum Privilege de-escalation not attempted as not running as root.
42:debug:extract extract phase started at Wed Nov  8 18:44:03 EST 2023
43:notice:extract --->  Extracting faad2
44:debug:extract Executing org.macports.extract (faad2)
45:info:extract --->  Extracting faad2-2.11.0.tar.gz
46:debug:extract setting option extract.args to '/opt/local/var/macports/distfiles/faad2/faad2-2.11.0.tar.gz'
47:debug:extract Environment:
48:debug:extract CC_PRINT_OPTIONS='YES'
49:debug:extract CC_PRINT_OPTIONS_FILE='/opt/local/var/macports/build/_opt_local_var_macports_sources_rsync.macports.org_macports_release_tarballs_ports_audio_faad2/faad2/work/.CC_PRINT_OPTIONS'
50:debug:extract CPATH='/opt/local/include'
51:debug:extract DEVELOPER_DIR='/Library/Developer/CommandLineTools'
52:debug:extract LIBRARY_PATH='/opt/local/lib'
53:debug:extract MACOSX_DEPLOYMENT_TARGET='10.13'
54:info:extract Executing:  cd "/opt/local/var/macports/build/_opt_local_var_macports_sources_rsync.macports.org_macports_release_tarballs_ports_audio_faad2/faad2/work" && /usr/bin/gzip -dc '/opt/local/var/macports/distfiles/faad2/faad2-2.11.0.tar.gz' | /usr/bin/tar -xf -
55:debug:extract system:  cd "/opt/local/var/macports/build/_opt_local_var_macports_sources_rsync.macports.org_macports_release_tarballs_ports_audio_faad2/faad2/work" && /usr/bin/gzip -dc '/opt/local/var/macports/distfiles/faad2/faad2-2.11.0.tar.gz' | /usr/bin/tar -xf -
56:debug:extract euid/egid changed to: 0/0
57:debug:extract chowned /opt/local/var/macports/build/_opt_local_var_macports_sources_rsync.macports.org_macports_release_tarballs_ports_audio_faad2/faad2/work to macports
58:debug:extract euid/egid changed to: 504/501
59:debug:extract Privilege de-escalation not attempted as not running as root.
60:debug:patch patch phase started at Wed Nov  8 18:44:03 EST 2023
61:debug:patch Executing org.macports.patch (faad2)
62:notice:patch --->  Applying patches to faad2
63:info:patch --->  Applying patch-build-shared-libraries.diff
64:debug:patch Environment:
65:debug:patch CC_PRINT_OPTIONS='YES'
66:debug:patch CC_PRINT_OPTIONS_FILE='/opt/local/var/macports/build/_opt_local_var_macports_sources_rsync.macports.org_macports_release_tarballs_ports_audio_faad2/faad2/work/.CC_PRINT_OPTIONS'
67:debug:patch CPATH='/opt/local/include'
68:debug:patch DEVELOPER_DIR='/Library/Developer/CommandLineTools'
69:debug:patch LIBRARY_PATH='/opt/local/lib'
70:debug:patch MACOSX_DEPLOYMENT_TARGET='10.13'
71:info:patch Executing:  cd "/opt/local/var/macports/build/_opt_local_var_macports_sources_rsync.macports.org_macports_release_tarballs_ports_audio_faad2/faad2/work/faad2-2.11.0" && /usr/bin/patch -p0 < '/opt/local/var/macports/sources/rsync.macports.org/macports/release/tarballs/ports/audio/faad2/files/patch-build-shared-libraries.diff'
72:debug:patch system:  cd "/opt/local/var/macports/build/_opt_local_var_macports_sources_rsync.macports.org_macports_release_tarballs_ports_audio_faad2/faad2/work/faad2-2.11.0" && /usr/bin/patch -p0 < '/opt/local/var/macports/sources/rsync.macports.org/macports/release/tarballs/ports/audio/faad2/files/patch-build-shared-libraries.diff'
73:info:patch patching file CMakeLists.txt
74:debug:patch Privilege de-escalation not attempted as not running as root.
75:debug:configure configure phase started at Wed Nov  8 18:44:03 EST 2023
76:notice:configure --->  Configuring faad2
77:debug:configure Preferred compilers: clang macports-clang-16 macports-clang-15 macports-clang-14 macports-clang-13 macports-clang-12 macports-clang-11 macports-clang-10 macports-clang-9.0 macports-clang-8.0 macports-clang-7.0 macports-clang-6.0 macports-clang-5.0
78:debug:configure Using compiler 'Xcode Clang'
79:debug:configure Executing proc-pre-org.macports.configure-configure-0
80:debug:configure CPPFLAGS="-I/opt/local/include" inserted into CFLAGS="-Os -DNDEBUG -I/opt/local/include" CXXFLAGS="-Os -DNDEBUG -I/opt/local/include -stdlib=libc++"
81:debug:configure Executing proc-pre-org.macports.configure-configure-1
82:debug:configure Executing org.macports.configure (faad2)
83:debug:configure Environment:
84:debug:configure CC='/usr/bin/clang'
85:debug:configure CC_PRINT_OPTIONS='YES'
86:debug:configure CC_PRINT_OPTIONS_FILE='/opt/local/var/macports/build/_opt_local_var_macports_sources_rsync.macports.org_macports_release_tarballs_ports_audio_faad2/faad2/work/.CC_PRINT_OPTIONS'
87:debug:configure CFLAGS='-pipe -Os -DNDEBUG -I/opt/local/include'
88:debug:configure CPATH='/opt/local/include'
89:debug:configure CXX='/usr/bin/clang++'
90:debug:configure CXXFLAGS='-pipe -Os -DNDEBUG -I/opt/local/include -stdlib=libc++'
91:debug:configure DEVELOPER_DIR='/Library/Developer/CommandLineTools'
92:debug:configure F90FLAGS='-pipe -Os'
93:debug:configure FCFLAGS='-pipe -Os'
94:debug:configure FFLAGS='-pipe -Os'
95:debug:configure INSTALL='/usr/bin/install -c'
96:debug:configure LDFLAGS='-L/opt/local/lib -Wl,-headerpad_max_install_names'
97:debug:configure LIBRARY_PATH='/opt/local/lib'
98:debug:configure MACOSX_DEPLOYMENT_TARGET='10.13'
99:debug:configure OBJC='/usr/bin/clang'
100:debug:configure OBJCFLAGS='-pipe -Os -I/opt/local/include'
101:debug:configure OBJCXX='/usr/bin/clang++'
102:debug:configure OBJCXXFLAGS='-pipe -Os -DNDEBUG -I/opt/local/include -I/opt/local/include -stdlib=libc++'
103:info:configure Executing:  cd "/opt/local/var/macports/build/_opt_local_var_macports_sources_rsync.macports.org_macports_release_tarballs_ports_audio_faad2/faad2/work/build" && /opt/local/bin/cmake -G "CodeBlocks - Unix Makefiles" -DCMAKE_BUILD_TYPE=MacPorts -DCMAKE_INSTALL_PREFIX="/opt/local" -DCMAKE_INSTALL_NAME_DIR="/opt/local/lib" -DCMAKE_SYSTEM_PREFIX_PATH="/opt/local;/usr" -DCMAKE_C_COMPILER="$CC" -DCMAKE_CXX_COMPILER="$CXX" -DCMAKE_OBJC_COMPILER="$CC" -DCMAKE_OBJCXX_COMPILER="$CXX" -DCMAKE_POLICY_DEFAULT_CMP0025=NEW -DCMAKE_POLICY_DEFAULT_CMP0060=NEW -DCMAKE_VERBOSE_MAKEFILE=ON -DCMAKE_COLOR_MAKEFILE=ON -DCMAKE_FIND_FRAMEWORK=LAST -DCMAKE_EXPORT_COMPILE_COMMANDS=ON -DCMAKE_MAKE_PROGRAM=/usr/bin/make -DCMAKE_MODULE_PATH="/opt/local/share/cmake/Modules" -DCMAKE_PREFIX_PATH="/opt/local/share/cmake/Modules" -DCMAKE_BUILD_WITH_INSTALL_RPATH:BOOL=ON -DCMAKE_INSTALL_RPATH="/opt/local/lib" -Wno-dev -DCMAKE_OSX_ARCHITECTURES="x86_64;i386" -DCMAKE_OSX_DEPLOYMENT_TARGET="10.13" -DCMAKE_OSX_SYSROOT="/" /opt/local/var/macports/build/_opt_local_var_macports_sources_rsync.macports.org_macports_release_tarballs_ports_audio_faad2/faad2/work/faad2-2.11.0
104:debug:configure system:  cd "/opt/local/var/macports/build/_opt_local_var_macports_sources_rsync.macports.org_macports_release_tarballs_ports_audio_faad2/faad2/work/build" && /opt/local/bin/cmake -G "CodeBlocks - Unix Makefiles" -DCMAKE_BUILD_TYPE=MacPorts -DCMAKE_INSTALL_PREFIX="/opt/local" -DCMAKE_INSTALL_NAME_DIR="/opt/local/lib" -DCMAKE_SYSTEM_PREFIX_PATH="/opt/local;/usr" -DCMAKE_C_COMPILER="$CC" -DCMAKE_CXX_COMPILER="$CXX" -DCMAKE_OBJC_COMPILER="$CC" -DCMAKE_OBJCXX_COMPILER="$CXX" -DCMAKE_POLICY_DEFAULT_CMP0025=NEW -DCMAKE_POLICY_DEFAULT_CMP0060=NEW -DCMAKE_VERBOSE_MAKEFILE=ON -DCMAKE_COLOR_MAKEFILE=ON -DCMAKE_FIND_FRAMEWORK=LAST -DCMAKE_EXPORT_COMPILE_COMMANDS=ON -DCMAKE_MAKE_PROGRAM=/usr/bin/make -DCMAKE_MODULE_PATH="/opt/local/share/cmake/Modules" -DCMAKE_PREFIX_PATH="/opt/local/share/cmake/Modules" -DCMAKE_BUILD_WITH_INSTALL_RPATH:BOOL=ON -DCMAKE_INSTALL_RPATH="/opt/local/lib" -Wno-dev -DCMAKE_OSX_ARCHITECTURES="x86_64;i386" -DCMAKE_OSX_DEPLOYMENT_TARGET="10.13" -DCMAKE_OSX_SYSROOT="/" /opt/local/var/macports/build/_opt_local_var_macports_sources_rsync.macports.org_macports_release_tarballs_ports_audio_faad2/faad2/work/faad2-2.11.0
105:info:configure -- The C compiler identification is AppleClang 10.0.0.10001044
106:info:configure -- Detecting C compiler ABI info
107:info:configure -- Detecting C compiler ABI info - done
108:info:configure -- Check for working C compiler: /usr/bin/clang - skipped
109:info:configure -- Detecting C compile features
110:info:configure -- Detecting C compile features - done
111:info:configure -- FAAD PACKAGE_VERSION: 2.11.0
112:info:configure -- Configuring done
113:info:configure -- Generating done
114:info:configure CMake Warning:
115:info:configure   Manually-specified variables were not used by the project:
116:info:configure     CMAKE_CXX_COMPILER
117:info:configure     CMAKE_OBJCXX_COMPILER
118:info:configure     CMAKE_OBJC_COMPILER
119:info:configure     CMAKE_POLICY_DEFAULT_CMP0025
120:info:configure     CMAKE_POLICY_DEFAULT_CMP0060
121:info:configure -- Build files have been written to: /opt/local/var/macports/build/_opt_local_var_macports_sources_rsync.macports.org_macports_release_tarballs_ports_audio_faad2/faad2/work/build
122:debug:configure Executing proc-post-org.macports.configure-configure-0
123:debug:configure configure.ccache restored to no
124:debug:configure Executing proc-post-org.macports.configure-configure-1
125:debug:configure Executing portconfigure::configure_finish
126:debug:configure Privilege de-escalation not attempted as not running as root.
127:debug:build build phase started at Wed Nov  8 18:44:05 EST 2023
128:notice:build --->  Building faad2
129:debug:build Executing org.macports.build (faad2)
130:debug:build Environment:
131:debug:build CC_PRINT_OPTIONS='YES'
132:debug:build CC_PRINT_OPTIONS_FILE='/opt/local/var/macports/build/_opt_local_var_macports_sources_rsync.macports.org_macports_release_tarballs_ports_audio_faad2/faad2/work/.CC_PRINT_OPTIONS'
133:debug:build CPATH='/opt/local/include'
134:debug:build DEVELOPER_DIR='/Library/Developer/CommandLineTools'
135:debug:build LIBRARY_PATH='/opt/local/lib'
136:debug:build MACOSX_DEPLOYMENT_TARGET='10.13'
137:info:build Executing:  cd "/opt/local/var/macports/build/_opt_local_var_macports_sources_rsync.macports.org_macports_release_tarballs_ports_audio_faad2/faad2/work/build" && /usr/bin/make -j2 -w all VERBOSE=ON
138:debug:build system:  cd "/opt/local/var/macports/build/_opt_local_var_macports_sources_rsync.macports.org_macports_release_tarballs_ports_audio_faad2/faad2/work/build" && /usr/bin/make -j2 -w all VERBOSE=ON
139:info:build make: Entering directory `/opt/local/var/macports/build/_opt_local_var_macports_sources_rsync.macports.org_macports_release_tarballs_ports_audio_faad2/faad2/work/build'
140:info:build /opt/local/bin/cmake -S/opt/local/var/macports/build/_opt_local_var_macports_sources_rsync.macports.org_macports_release_tarballs_ports_audio_faad2/faad2/work/faad2-2.11.0 -B/opt/local/var/macports/build/_opt_local_var_macports_sources_rsync.macports.org_macports_release_tarballs_ports_audio_faad2/faad2/work/build --check-build-system CMakeFiles/Makefile.cmake 0
141:info:build /opt/local/bin/cmake -E cmake_progress_start /opt/local/var/macports/build/_opt_local_var_macports_sources_rsync.macports.org_macports_release_tarballs_ports_audio_faad2/faad2/work/build/CMakeFiles /opt/local/var/macports/build/_opt_local_var_macports_sources_rsync.macports.org_macports_release_tarballs_ports_audio_faad2/faad2/work/build//CMakeFiles/progress.marks
142:info:build /Library/Developer/CommandLineTools/usr/bin/make  -f CMakeFiles/Makefile2 all
143:info:build make[1]: Entering directory `/opt/local/var/macports/build/_opt_local_var_macports_sources_rsync.macports.org_macports_release_tarballs_ports_audio_faad2/faad2/work/build'
144:info:build /Library/Developer/CommandLineTools/usr/bin/make  -f CMakeFiles/faad.dir/build.make CMakeFiles/faad.dir/depend
145:info:build /Library/Developer/CommandLineTools/usr/bin/make  -f CMakeFiles/faad_drm.dir/build.make CMakeFiles/faad_drm.dir/depend
146:info:build make[2]: Entering directory `/opt/local/var/macports/build/_opt_local_var_macports_sources_rsync.macports.org_macports_release_tarballs_ports_audio_faad2/faad2/work/build'
147:info:build make[2]: Entering directory `/opt/local/var/macports/build/_opt_local_var_macports_sources_rsync.macports.org_macports_release_tarballs_ports_audio_faad2/faad2/work/build'
148:info:build cd /opt/local/var/macports/build/_opt_local_var_macports_sources_rsync.macports.org_macports_release_tarballs_ports_audio_faad2/faad2/work/build && /opt/local/bin/cmake -E cmake_depends "Unix Makefiles" /opt/local/var/macports/build/_opt_local_var_macports_sources_rsync.macports.org_macports_release_tarballs_ports_audio_faad2/faad2/work/faad2-2.11.0 /opt/local/var/macports/build/_opt_local_var_macports_sources_rsync.macports.org_macports_release_tarballs_ports_audio_faad2/faad2/work/faad2-2.11.0 /opt/local/var/macports/build/_opt_local_var_macports_sources_rsync.macports.org_macports_release_tarballs_ports_audio_faad2/faad2/work/build /opt/local/var/macports/build/_opt_local_var_macports_sources_rsync.macports.org_macports_release_tarballs_ports_audio_faad2/faad2/work/build /opt/local/var/macports/build/_opt_local_var_macports_sources_rsync.macports.org_macports_release_tarballs_ports_audio_faad2/faad2/work/build/CMakeFiles/faad_drm.dir/DependInfo.cmake --color=
149:info:build cd /opt/local/var/macports/build/_opt_local_var_macports_sources_rsync.macports.org_macports_release_tarballs_ports_audio_faad2/faad2/work/build && /opt/local/bin/cmake -E cmake_depends "Unix Makefiles" /opt/local/var/macports/build/_opt_local_var_macports_sources_rsync.macports.org_macports_release_tarballs_ports_audio_faad2/faad2/work/faad2-2.11.0 /opt/local/var/macports/build/_opt_local_var_macports_sources_rsync.macports.org_macports_release_tarballs_ports_audio_faad2/faad2/work/faad2-2.11.0 /opt/local/var/macports/build/_opt_local_var_macports_sources_rsync.macports.org_macports_release_tarballs_ports_audio_faad2/faad2/work/build /opt/local/var/macports/build/_opt_local_var_macports_sources_rsync.macports.org_macports_release_tarballs_ports_audio_faad2/faad2/work/build /opt/local/var/macports/build/_opt_local_var_macports_sources_rsync.macports.org_macports_release_tarballs_ports_audio_faad2/faad2/work/build/CMakeFiles/faad.dir/DependInfo.cmake --color=
150:info:build make[2]: Leaving directory `/opt/local/var/macports/build/_opt_local_var_macports_sources_rsync.macports.org_macports_release_tarballs_ports_audio_faad2/faad2/work/build'
151:info:build /Library/Developer/CommandLineTools/usr/bin/make  -f CMakeFiles/faad.dir/build.make CMakeFiles/faad.dir/build
152:info:build make[2]: Entering directory `/opt/local/var/macports/build/_opt_local_var_macports_sources_rsync.macports.org_macports_release_tarballs_ports_audio_faad2/faad2/work/build'
153:info:build make[2]: Leaving directory `/opt/local/var/macports/build/_opt_local_var_macports_sources_rsync.macports.org_macports_release_tarballs_ports_audio_faad2/faad2/work/build'
154:info:build /Library/Developer/CommandLineTools/usr/bin/make  -f CMakeFiles/faad_drm.dir/build.make CMakeFiles/faad_drm.dir/build
155:info:build make[2]: Entering directory `/opt/local/var/macports/build/_opt_local_var_macports_sources_rsync.macports.org_macports_release_tarballs_ports_audio_faad2/faad2/work/build'
156:info:build [  0%] Building C object CMakeFiles/faad.dir/libfaad/bits.c.o
157:info:build /usr/bin/clang -DAPPLY_DRC -DHAVE_INTTYPES_H=1 -DHAVE_MEMCPY=1 -DHAVE_STRINGS_H=1 -DHAVE_STRING_H=1 -DHAVE_SYS_STAT_H=1 -DHAVE_SYS_TYPES_H=1 -DPACKAGE_VERSION=\"2.11.0\" -DSTDC_HEADERS=1 -Dfaad_EXPORTS -I/opt/local/var/macports/build/_opt_local_var_macports_sources_rsync.macports.org_macports_release_tarballs_ports_audio_faad2/faad2/work/build/include -I/opt/local/var/macports/build/_opt_local_var_macports_sources_rsync.macports.org_macports_release_tarballs_ports_audio_faad2/faad2/work/faad2-2.11.0/libfaad -pipe -Os -DNDEBUG -I/opt/local/include -arch x86_64 -arch i386 -mmacosx-version-min=10.13 -fPIC -fvisibility=hidden -Wall -pedantic -MD -MT CMakeFiles/faad.dir/libfaad/bits.c.o -MF CMakeFiles/faad.dir/libfaad/bits.c.o.d -o CMakeFiles/faad.dir/libfaad/bits.c.o -c /opt/local/var/macports/build/_opt_local_var_macports_sources_rsync.macports.org_macports_release_tarballs_ports_audio_faad2/faad2/work/faad2-2.11.0/libfaad/bits.c
158:info:build [  0%] Building C object CMakeFiles/faad_drm.dir/libfaad/bits.c.o
159:info:build /usr/bin/clang -DAPPLY_DRC -DDRM_SUPPORT -DHAVE_INTTYPES_H=1 -DHAVE_MEMCPY=1 -DHAVE_STRINGS_H=1 -DHAVE_STRING_H=1 -DHAVE_SYS_STAT_H=1 -DHAVE_SYS_TYPES_H=1 -DPACKAGE_VERSION=\"2.11.0\" -DSTDC_HEADERS=1 -Dfaad_drm_EXPORTS -I/opt/local/var/macports/build/_opt_local_var_macports_sources_rsync.macports.org_macports_release_tarballs_ports_audio_faad2/faad2/work/build/include -I/opt/local/var/macports/build/_opt_local_var_macports_sources_rsync.macports.org_macports_release_tarballs_ports_audio_faad2/faad2/work/faad2-2.11.0/libfaad -pipe -Os -DNDEBUG -I/opt/local/include -arch x86_64 -arch i386 -mmacosx-version-min=10.13 -fPIC -fvisibility=hidden -Wall -pedantic -MD -MT CMakeFiles/faad_drm.dir/libfaad/bits.c.o -MF CMakeFiles/faad_drm.dir/libfaad/bits.c.o.d -o CMakeFiles/faad_drm.dir/libfaad/bits.c.o -c /opt/local/var/macports/build/_opt_local_var_macports_sources_rsync.macports.org_macports_release_tarballs_ports_audio_faad2/faad2/work/faad2-2.11.0/libfaad/bits.c
160:info:build In file included from /opt/local/var/macports/build/_opt_local_var_macports_sources_rsync.macports.org_macports_release_tarballs_ports_audio_faad2/faad2/work/faad2-2.11.0/libfaad/bits.c:31:
161:info:build In file included from /opt/local/var/macports/build/_opt_local_var_macports_sources_rsync.macports.org_macports_release_tarballs_ports_audio_faad2/faad2/work/faad2-2.11.0/libfaad/common.h:377:
162:info:build /usr/include/math.h:485:17: error: conflicting types for 'lrintf'
163:info:build extern long int lrintf(float);
164:info:build                 ^
165:info:build /opt/local/var/macports/build/_opt_local_var_macports_sources_rsync.macports.org_macports_release_tarballs_ports_audio_faad2/faad2/work/faad2-2.11.0/libfaad/common.h:342:23: note: previous definition is here
166:info:build     static INLINE int lrintf(float f)
167:info:build                       ^
168:info:build 1 error generated.
169:info:build make[2]: *** [CMakeFiles/faad.dir/libfaad/bits.c.o] Error 1
170:info:build make[2]: Leaving directory `/opt/local/var/macports/build/_opt_local_var_macports_sources_rsync.macports.org_macports_release_tarballs_ports_audio_faad2/faad2/work/build'
171:info:build make[1]: *** [CMakeFiles/faad.dir/all] Error 2
172:info:build make[1]: *** Waiting for unfinished jobs....
173:info:build In file included from /opt/local/var/macports/build/_opt_local_var_macports_sources_rsync.macports.org_macports_release_tarballs_ports_audio_faad2/faad2/work/faad2-2.11.0/libfaad/bits.c:31:
174:info:build In file included from /opt/local/var/macports/build/_opt_local_var_macports_sources_rsync.macports.org_macports_release_tarballs_ports_audio_faad2/faad2/work/faad2-2.11.0/libfaad/common.h:377:
175:info:build /usr/include/math.h:485:17: error: conflicting types for 'lrintf'
176:info:build extern long int lrintf(float);
177:info:build                 ^
178:info:build /opt/local/var/macports/build/_opt_local_var_macports_sources_rsync.macports.org_macports_release_tarballs_ports_audio_faad2/faad2/work/faad2-2.11.0/libfaad/common.h:342:23: note: previous definition is here
179:info:build     static INLINE int lrintf(float f)
180:info:build                       ^
181:info:build [  1%] Building C object CMakeFiles/faad_drm.dir/libfaad/cfft.c.o
182:info:build /usr/bin/clang -DAPPLY_DRC -DDRM_SUPPORT -DHAVE_INTTYPES_H=1 -DHAVE_MEMCPY=1 -DHAVE_STRINGS_H=1 -DHAVE_STRING_H=1 -DHAVE_SYS_STAT_H=1 -DHAVE_SYS_TYPES_H=1 -DPACKAGE_VERSION=\"2.11.0\" -DSTDC_HEADERS=1 -Dfaad_drm_EXPORTS -I/opt/local/var/macports/build/_opt_local_var_macports_sources_rsync.macports.org_macports_release_tarballs_ports_audio_faad2/faad2/work/build/include -I/opt/local/var/macports/build/_opt_local_var_macports_sources_rsync.macports.org_macports_release_tarballs_ports_audio_faad2/faad2/work/faad2-2.11.0/libfaad -pipe -Os -DNDEBUG -I/opt/local/include -arch x86_64 -arch i386 -mmacosx-version-min=10.13 -fPIC -fvisibility=hidden -Wall -pedantic -MD -MT CMakeFiles/faad_drm.dir/libfaad/cfft.c.o -MF CMakeFiles/faad_drm.dir/libfaad/cfft.c.o.d -o CMakeFiles/faad_drm.dir/libfaad/cfft.c.o -c /opt/local/var/macports/build/_opt_local_var_macports_sources_rsync.macports.org_macports_release_tarballs_ports_audio_faad2/faad2/work/faad2-2.11.0/libfaad/cfft.c
183:info:build 1 error generated.
184:info:build make[2]: *** [CMakeFiles/faad_drm.dir/libfaad/bits.c.o] Error 1
185:info:build make[2]: *** Waiting for unfinished jobs....
186:info:build In file included from /opt/local/var/macports/build/_opt_local_var_macports_sources_rsync.macports.org_macports_release_tarballs_ports_audio_faad2/faad2/work/faad2-2.11.0/libfaad/cfft.c:40:
187:info:build In file included from /opt/local/var/macports/build/_opt_local_var_macports_sources_rsync.macports.org_macports_release_tarballs_ports_audio_faad2/faad2/work/faad2-2.11.0/libfaad/common.h:377:
188:info:build /usr/include/math.h:485:17: error: conflicting types for 'lrintf'
189:info:build extern long int lrintf(float);
190:info:build                 ^
191:info:build /opt/local/var/macports/build/_opt_local_var_macports_sources_rsync.macports.org_macports_release_tarballs_ports_audio_faad2/faad2/work/faad2-2.11.0/libfaad/common.h:342:23: note: previous definition is here
192:info:build     static INLINE int lrintf(float f)
193:info:build                       ^
194:info:build 1 error generated.
195:info:build make[2]: *** [CMakeFiles/faad_drm.dir/libfaad/cfft.c.o] Error 1
196:info:build make[2]: Leaving directory `/opt/local/var/macports/build/_opt_local_var_macports_sources_rsync.macports.org_macports_release_tarballs_ports_audio_faad2/faad2/work/build'
197:info:build make[1]: *** [CMakeFiles/faad_drm.dir/all] Error 2
198:info:build make[1]: Leaving directory `/opt/local/var/macports/build/_opt_local_var_macports_sources_rsync.macports.org_macports_release_tarballs_ports_audio_faad2/faad2/work/build'
199:info:build make: *** [all] Error 2
200:info:build make: Leaving directory `/opt/local/var/macports/build/_opt_local_var_macports_sources_rsync.macports.org_macports_release_tarballs_ports_audio_faad2/faad2/work/build'
201:info:build Command failed:  cd "/opt/local/var/macports/build/_opt_local_var_macports_sources_rsync.macports.org_macports_release_tarballs_ports_audio_faad2/faad2/work/build" && /usr/bin/make -j2 -w all VERBOSE=ON
202:info:build Exit code: 2
203:error:build Failed to build faad2: command execution failed
204:debug:build Error code: CHILDSTATUS 7738 2
205:debug:build Backtrace: command execution failed
206:debug:build     while executing
207:debug:build "system {*}$notty {*}$callback {*}$nice $fullcmdstring"
208:debug:build     invoked from within
209:debug:build "command_exec -callback portprogress::target_progress_callback build"
210:debug:build     (procedure "portbuild::build_main" line 8)
211:debug:build     invoked from within
212:debug:build "$procedure $targetname"
213:error:build See /opt/local/var/macports/logs/_opt_local_var_macports_sources_rsync.macports.org_macports_release_tarballs_ports_audio_faad2/faad2/main.log for details.